Target
Mitogen-activated protein kinase kinase kinase kinase 2
Ligand
BDBM47630
Substrate
Meas. Tech.
Dose Response Confirmation via Multiplex HTS Assay for Inhibitors of MEK Kinase PB1 Domains, specifically MEK5 binding to MEK Kinase 2 Wildtype
EC50
1120±n/a nM
Citation
 PubChem, PC Dose Response Confirmation via Multiplex HTS Assay for Inhibitors of MEK Kinase PB1 Domains, specifically MEK5 binding to MEK Kinase 2 Wildtype PubChem Bioassay (2009)[AID] 
Target
Name:
Mitogen-activated protein kinase kinase kinase kinase 2
Synonyms:
2.7.11.1 GC kinase Germinal center kinase MAP4K2 MEK kinase kinase 2 RAB8IP | Rab8-interacting protein
Type:
Mol. Mass.:
91551.35
Organism:
Homo sapiens (Human)
Description:
Residue:
820
  
Inhibitor
Name:
BDBM47630
Synonyms:
(5Z)-3-butyl-5-[(2E,4E)-5-phenylazanylpenta-2,4-dienylidene]-2-sulfanylidene-1,3-thiazolidin-4-one (5Z)-5-[(2E,4E)-5-anilinopenta-2,4-dienylidene]-3-butyl-2-sulfanylidene-4-thiazolidinone MLS000717916 cid_5759276
Type:
Small organic molecule
Emp. Form.:
C18H20N2OS2
Mol. Mass.:
344.494
SMILES:
CCCCn1c(O)c(C=CC=CC=Nc2ccccc2)sc1=S
: