Target
Mitogen-activated protein kinase kinase kinase kinase 2
Ligand
BDBM51836
Substrate
Meas. Tech.
Dose Response Confirmation via Multiplex HTS Assay for Inhibitors of MEK Kinase PB1 Domains, specifically MEK5 binding to MEK Kinase 2 Wildtype
EC50
3510±n/a nM
Citation
 PubChem, PC Dose Response Confirmation via Multiplex HTS Assay for Inhibitors of MEK Kinase PB1 Domains, specifically MEK5 binding to MEK Kinase 2 Wildtype PubChem Bioassay (2009)[AID] 
Target
Name:
Mitogen-activated protein kinase kinase kinase kinase 2
Synonyms:
2.7.11.1 GC kinase Germinal center kinase MAP4K2 MEK kinase kinase 2 RAB8IP | Rab8-interacting protein
Type:
Mol. Mass.:
91551.35
Organism:
Homo sapiens (Human)
Description:
Residue:
820
  
Inhibitor
Name:
BDBM51836
Synonyms:
(5E)-3-methyl-5-[(5-phenyl-2-furanyl)methylidene]-2-sulfanylidene-4-thiazolidinone (5E)-3-methyl-5-[(5-phenylfuran-2-yl)methylidene]-2-sulfanylidene-1,3-thiazolidin-4-one SMR000285210 | cid_2140739
Type:
Small organic molecule
Emp. Form.:
C15H11NO2S2
Mol. Mass.:
301.383
SMILES:
CN1C(=S)S\C(=C\c2ccc(o2)-c2ccccc2)C1=O
: