Target
Mitogen-activated protein kinase kinase kinase kinase 2
Ligand
BDBM51846
Substrate
Meas. Tech.
Dose Response Confirmation via Multiplex HTS Assay for Inhibitors of MEK Kinase PB1 Domains, specifically MEK5 binding to MEK Kinase 2 Wildtype
EC50
30000±n/a nM
Citation
 PubChem, PC Dose Response Confirmation via Multiplex HTS Assay for Inhibitors of MEK Kinase PB1 Domains, specifically MEK5 binding to MEK Kinase 2 Wildtype PubChem Bioassay (2009)[AID] 
Target
Name:
Mitogen-activated protein kinase kinase kinase kinase 2
Synonyms:
2.7.11.1 GC kinase Germinal center kinase MAP4K2 MEK kinase kinase 2 RAB8IP | Rab8-interacting protein
Type:
Mol. Mass.:
91551.35
Organism:
Homo sapiens (Human)
Description:
Residue:
820
  
Inhibitor
Name:
BDBM51846
Synonyms:
9-chloranyl-N-(5-chloranylpyridin-2-yl)-2,3-dihydro-1H-cyclopenta[b]quinoline-6-carboxamide 9-chloro-N-(5-chloro-2-pyridyl)-2,3-dihydro-1H-cyclopenta[b]quinoline-6-carboxamide MLS000731441 cid_16194247
Type:
Small organic molecule
Emp. Form.:
C18H13Cl2N3O
Mol. Mass.:
358.221
SMILES:
Clc1ccc(NC(=O)c2ccc3c(Cl)c4CCCc4nc3c2)nc1
: