Target
Mitogen-activated protein kinase kinase kinase kinase 2
Ligand
BDBM51868
Substrate
Meas. Tech.
Dose Response Confirmation via Multiplex HTS Assay for Inhibitors of MEK Kinase PB1 Domains, specifically MEK5 binding to MEK Kinase 2 Wildtype
EC50
3730±n/a nM
Citation
 PubChem, PC Dose Response Confirmation via Multiplex HTS Assay for Inhibitors of MEK Kinase PB1 Domains, specifically MEK5 binding to MEK Kinase 2 Wildtype PubChem Bioassay (2009)[AID] 
Target
Name:
Mitogen-activated protein kinase kinase kinase kinase 2
Synonyms:
2.7.11.1 GC kinase Germinal center kinase MAP4K2 MEK kinase kinase 2 RAB8IP | Rab8-interacting protein
Type:
Mol. Mass.:
91551.35
Organism:
Homo sapiens (Human)
Description:
Residue:
820
  
Inhibitor
Name:
BDBM51868
Synonyms:
MLS000562841 YI-IW | cid_16196582
Type:
Small organic molecule
Emp. Form.:
C54H76ClN17O6
Mol. Mass.:
1094.745
SMILES:
Cl.CCC(C)[C@H](N)c1cn(nn1)[C@@H](Cc1cc2ccccc2[nH]1)C(=O)N1CCN(CC1)c1nc(NCCOCCOCCOCC#C)nc(n1)N1CCN(CC1)C(=O)[C@H]([C@@H](C)CC)n1cc(nn1)[C@@H](N)Cc1ccc(O)cc1
: