Target
Beta-lactamase
Ligand
BDBM51960
Substrate
Meas. Tech.
Epi-absorbance-based dose response biochemical high throughput screening assay for selective inhibitors of VIM-2 metallo-beta-lactamase
IC50
1485±n/a nM
Citation
 PubChem, PC Epi-absorbance-based dose response biochemical high throughput screening assay for selective inhibitors of VIM-2 metallo-beta-lactamase PubChem Bioassay (2009)[AID] 
Target
Name:
Beta-lactamase
Synonyms:
Beta lactamase
Type:
Enzyme Catalytic Domain
Mol. Mass.:
31513.38
Organism:
Pseudomonas aeruginosa
Description:
gi_114881106
Residue:
286
  
Inhibitor
Name:
BDBM51960
Synonyms:
4-[(6-keto-3-methyl-7,8,9,10-tetrahydrobenzo[c]chromen-1-yl)oxymethyl]-5-methyl-2-furoic acid 5-methyl-4-[(3-methyl-6-oxo-7,8,9,10-tetrahydrobenzo[c][1]benzopyran-1-yl)oxymethyl]-2-furancarboxylic acid 5-methyl-4-{[(3-methyl-6-oxo-7,8,9,10-tetrahydro-6H-benzo[c]chromen-1-yl)oxy]methyl}-2-furoic acid SMR000135929 | cid_1312855
Type:
Small organic molecule
Emp. Form.:
C21H20O6
Mol. Mass.:
368.3799
SMILES:
Cc1oc(cc1COc1cc(C)cc2oc(=O)c3CCCCc3c12)C(O)=O
: