Target
Beta-lactamase
Ligand
BDBM51986
Substrate
Meas. Tech.
Epi-absorbance-based dose response biochemical high throughput screening assay for selective inhibitors of VIM-2 metallo-beta-lactamase
IC50
9333±n/a nM
Citation
 PubChem, PC Epi-absorbance-based dose response biochemical high throughput screening assay for selective inhibitors of VIM-2 metallo-beta-lactamase PubChem Bioassay (2009)[AID] 
Target
Name:
Beta-lactamase
Synonyms:
Beta lactamase
Type:
Enzyme Catalytic Domain
Mol. Mass.:
31513.38
Organism:
Pseudomonas aeruginosa
Description:
gi_114881106
Residue:
286
  
Inhibitor
Name:
BDBM51986
Synonyms:
4-[(2-nitrobenzylidene)amino]-3-(trifluoromethyl)-1H-1,2,4-triazole-5-thione MLS000679015 cid_5156357
Type:
Small organic molecule
Emp. Form.:
C10H6F3N5O2S
Mol. Mass.:
317.247
SMILES:
[O-][N+](=O)c1ccccc1[CH+][N-]n1c(n[nH]c1=S)C(F)(F)F
: