Target
Beta-lactamase
Ligand
BDBM52042
Substrate
Meas. Tech.
Epi-absorbance-based dose response biochemical high throughput screening assay for selective inhibitors of VIM-2 metallo-beta-lactamase
IC50
15240±n/a nM
Citation
 PubChem, PC Epi-absorbance-based dose response biochemical high throughput screening assay for selective inhibitors of VIM-2 metallo-beta-lactamase PubChem Bioassay (2009)[AID] 
Target
Name:
Beta-lactamase
Synonyms:
Beta lactamase
Type:
Enzyme Catalytic Domain
Mol. Mass.:
31513.38
Organism:
Pseudomonas aeruginosa
Description:
gi_114881106
Residue:
286
  
Inhibitor
Name:
BDBM52042
Synonyms:
(2S)-1-[1-oxo-2-[(4,8,8-trimethyl-2-oxo-9,10-dihydropyrano[2,3-h][1]benzopyran-5-yl)oxy]ethyl]-2-pyrrolidinecarboxylic acid (2S)-1-[2-[(4,8,8-trimethyl-2-oxidanylidene-9,10-dihydropyrano[2,3-h]chromen-5-yl)oxy]ethanoyl]pyrrolidine-2-carboxylic acid MLS001160389 cid_11920923
Type:
Small organic molecule
Emp. Form.:
C22H25NO7
Mol. Mass.:
415.4364
SMILES:
Cc1cc(=O)oc2c3CCC(C)(C)Oc3cc(OCC(=O)N3CCC[C@H]3C(O)=O)c12
: