Target
Lysine-specific histone demethylase 1A
Ligand
BDBM243411
Substrate
Meas. Tech.
LSD1 Inhibitory Assay
pH
8±n/a
Temperature
298.15±n/a K
IC50
<100.0±n/a nM
Comments
extracted
Citation
 Matsumoto, SHattori, YToyofuku, MMorimoto, SKojima, TKaku, TIto, M Cyclopropanamine compound and use thereof US Patent  US9718814 Publication Date 8/1/2017 
Target
Name:
Lysine-specific histone demethylase 1A
Synonyms:
AOF2 Flavin-containing amine oxidase domain-containing protein 2 KDM1A KIAA0601 Lysine-specific demethylase 1 (LSD1) Lysine-specific histone demethylase 1 (LSD1)
Type:
Enzyme
Mol. Mass.:
92901.01
Organism:
Homo sapiens (Human)
Description:
O60341
Residue:
852
  
Inhibitor
Name:
BDBM243411
Synonyms:
5-((1R,2R)-2-(cis- (4-aminocyclohexyl)- amino)cyclopropyl)- N-(4,4- difluorocyclohexyl)- thiophene-3- carboxamide or5-((1R,2R)-2-(trans-(4-aminocyclohexyl)-amino)cyclopropyl)-N-(4,4-difluorocyclohexyl)-thiophene-3-carboxamide US10053456, 46 US10968213, Example 46 US9920047, 46
Type:
Small organic molecule
Emp. Form.:
C20H29F2N3OS
Mol. Mass.:
397.526
SMILES:
NC1CCC(CC1)N[C@@H]1C[C@H]1c1cc(cs1)C(=O)NC1CCC(F)(F)CC1
: