Target
Beta-lactamase
Ligand
BDBM51963
Substrate
Meas. Tech.
Epi-absorbance-based counterscreen for selective VIM-2 inhibitors: dose response biochemical high throughput screening assay to identify inhibitors of IMP-1 metallo-beta-lactamase.
IC50
59640±n/a nM
Citation
 PubChem, PC Epi-absorbance-based counterscreen for selective VIM-2 inhibitors: dose response biochemical high throughput screening assay to identify inhibitors of IMP-1 metallo-beta-lactamase. PubChem Bioassay (2009)[AID] 
Target
Name:
Beta-lactamase
Synonyms:
Beta-lactamase | metallo-beta-lactamase IMP-1
Type:
Enzyme Catalytic Domain
Mol. Mass.:
27125.88
Organism:
Pseudomonas aeruginosa
Description:
gi_27368096
Residue:
246
  
Inhibitor
Name:
BDBM51963
Synonyms:
MLS000557398 N-[5-[(2-fluorophenyl)methylsulfanylmethyl]-1,3,4-thiadiazol-2-yl]-2,2-dimethyl-propanamide N-[5-[[(2-fluorobenzyl)thio]methyl]-1,3,4-thiadiazol-2-yl]-2,2-dimethyl-propionamide SMR000148315 | cid_945654
Type:
Small organic molecule
Emp. Form.:
C15H18FN3OS2
Mol. Mass.:
339.451
SMILES:
CC(C)(C)C(=O)Nc1nnc(CSCc2ccccc2F)s1
: