Target
Beta-lactamase
Ligand
BDBM51985
Substrate
Meas. Tech.
Epi-absorbance-based counterscreen for selective VIM-2 inhibitors: dose response biochemical high throughput screening assay to identify inhibitors of IMP-1 metallo-beta-lactamase.
IC50
59640±n/a nM
Citation
 PubChem, PC Epi-absorbance-based counterscreen for selective VIM-2 inhibitors: dose response biochemical high throughput screening assay to identify inhibitors of IMP-1 metallo-beta-lactamase. PubChem Bioassay (2009)[AID] 
Target
Name:
Beta-lactamase
Synonyms:
Beta-lactamase | metallo-beta-lactamase IMP-1
Type:
Enzyme Catalytic Domain
Mol. Mass.:
27125.88
Organism:
Pseudomonas aeruginosa
Description:
gi_27368096
Residue:
246
  
Inhibitor
Name:
BDBM51985
Synonyms:
4-(2-methylallyl)-3-(2-thienyl)-1H-1,2,4-triazole-5-thione MLS000688190 cid_767260
Type:
Small organic molecule
Emp. Form.:
C10H11N3S2
Mol. Mass.:
237.344
SMILES:
CC(=C)Cn1c(n[nH]c1=S)-c1cccs1
: