Target
Beta-lactamase
Ligand
BDBM52038
Substrate
Meas. Tech.
Epi-absorbance-based counterscreen for selective VIM-2 inhibitors: dose response biochemical high throughput screening assay to identify inhibitors of IMP-1 metallo-beta-lactamase.
IC50
59640±n/a nM
Citation
 PubChem, PC Epi-absorbance-based counterscreen for selective VIM-2 inhibitors: dose response biochemical high throughput screening assay to identify inhibitors of IMP-1 metallo-beta-lactamase. PubChem Bioassay (2009)[AID] 
Target
Name:
Beta-lactamase
Synonyms:
Beta-lactamase | metallo-beta-lactamase IMP-1
Type:
Enzyme Catalytic Domain
Mol. Mass.:
27125.88
Organism:
Pseudomonas aeruginosa
Description:
gi_27368096
Residue:
246
  
Inhibitor
Name:
BDBM52038
Synonyms:
(2S)-1-[1-oxo-2-[(3,4,8,8-tetramethyl-2-oxo-9,10-dihydropyrano[2,3-h][1]benzopyran-5-yl)oxy]ethyl]-2-pyrrolidinecarboxylic acid (2S)-1-[2-[(3,4,8,8-tetramethyl-2-oxidanylidene-9,10-dihydropyrano[2,3-h]chromen-5-yl)oxy]ethanoyl]pyrrolidine-2-carboxylic acid MLS001160409 cid_16406937
Type:
Small organic molecule
Emp. Form.:
C23H27NO7
Mol. Mass.:
429.463
SMILES:
Cc1c(C)c(=O)oc2c3CCC(C)(C)Oc3cc(OCC(=O)N3CCC[C@H]3C(O)=O)c12
: