Target
Beta-lactamase
Ligand
BDBM51942
Substrate
Meas. Tech.
FRET-based counterscreen for selective VIM-2 inhibitors: dose response biochemical high throughput screening assay to identify epi-absorbance assay artifacts.
IC50
3610±n/a nM
Citation
 PubChem, PC FRET-based counterscreen for selective VIM-2 inhibitors: dose response biochemical high throughput screening assay to identify epi-absorbance assay artifacts. PubChem Bioassay (2009)[AID] 
Target
Name:
Beta-lactamase
Synonyms:
Beta lactamase
Type:
Enzyme Catalytic Domain
Mol. Mass.:
31513.38
Organism:
Pseudomonas aeruginosa
Description:
gi_114881106
Residue:
286
  
Inhibitor
Name:
BDBM51942
Synonyms:
MLS000029635 N-[2-[2-(diethylamino)-2-oxidanylidene-ethyl]sulfanyl-1,3-benzothiazol-6-yl]-2-(1-methylimidazol-2-yl)sulfanyl-ethanamide N-[2-[[2-(diethylamino)-2-keto-ethyl]thio]-1,3-benzothiazol-6-yl]-2-[(1-methylimidazol-2-yl)thio]acetamide SMR000011411 | cid_654026
Type:
Small organic molecule
Emp. Form.:
C19H23N5O2S3
Mol. Mass.:
449.613
SMILES:
CCN(CC)C(=O)CSc1nc2ccc(NC(=O)CSc3nccn3C)cc2s1
: