Target
Beta-lactamase
Ligand
BDBM51962
Substrate
Meas. Tech.
FRET-based counterscreen for selective VIM-2 inhibitors: dose response biochemical high throughput screening assay to identify epi-absorbance assay artifacts.
IC50
1993±n/a nM
Citation
 PubChem, PC FRET-based counterscreen for selective VIM-2 inhibitors: dose response biochemical high throughput screening assay to identify epi-absorbance assay artifacts. PubChem Bioassay (2009)[AID] 
Target
Name:
Beta-lactamase
Synonyms:
Beta lactamase
Type:
Enzyme Catalytic Domain
Mol. Mass.:
31513.38
Organism:
Pseudomonas aeruginosa
Description:
gi_114881106
Residue:
286
  
Inhibitor
Name:
BDBM51962
Synonyms:
4-butyl-3-(4-chloranyl-1,5-dimethyl-pyrazol-3-yl)-1H-1,2,4-triazole-5-thione 4-butyl-3-(4-chloro-1,5-dimethyl-pyrazol-3-yl)-1H-1,2,4-triazole-5-thione MLS000519348 cid_3331652
Type:
Small organic molecule
Emp. Form.:
C11H16ClN5S
Mol. Mass.:
285.796
SMILES:
CCCCn1c(n[nH]c1=S)-c1nn(C)c(C)c1Cl
: