Target
Beta-lactamase
Ligand
BDBM51982
Substrate
Meas. Tech.
FRET-based counterscreen for selective VIM-2 inhibitors: dose response biochemical high throughput screening assay to identify epi-absorbance assay artifacts.
IC50
3476±n/a nM
Citation
 PubChem, PC FRET-based counterscreen for selective VIM-2 inhibitors: dose response biochemical high throughput screening assay to identify epi-absorbance assay artifacts. PubChem Bioassay (2009)[AID] 
Target
Name:
Beta-lactamase
Synonyms:
Beta lactamase
Type:
Enzyme Catalytic Domain
Mol. Mass.:
31513.38
Organism:
Pseudomonas aeruginosa
Description:
gi_114881106
Residue:
286
  
Inhibitor
Name:
BDBM51982
Synonyms:
3-isopropyl-4-propyl-1H-1,2,4-triazole-5-thione MLS000678241 cid_855142
Type:
Small organic molecule
Emp. Form.:
C8H15N3S
Mol. Mass.:
185.29
SMILES:
CCCn1c(n[nH]c1=S)C(C)C
: