Target
Beta-lactamase
Ligand
BDBM52023
Substrate
Meas. Tech.
FRET-based counterscreen for selective VIM-2 inhibitors: dose response biochemical high throughput screening assay to identify epi-absorbance assay artifacts.
IC50
2953±n/a nM
Citation
 PubChem, PC FRET-based counterscreen for selective VIM-2 inhibitors: dose response biochemical high throughput screening assay to identify epi-absorbance assay artifacts. PubChem Bioassay (2009)[AID] 
Target
Name:
Beta-lactamase
Synonyms:
Beta lactamase
Type:
Enzyme Catalytic Domain
Mol. Mass.:
31513.38
Organism:
Pseudomonas aeruginosa
Description:
gi_114881106
Residue:
286
  
Inhibitor
Name:
BDBM52023
Synonyms:
5-(4-methylphenyl)-1,3-dihydropyrrolo[1,2-c][1,3]thiazole-6,7-dicarboxylic acid 5-(4-methylphenyl)-1H-pyrrolo[1,2-c][1,3]thiazole-6,7-dicarboxylic acid MLS001195344 cid_1472063
Type:
Small organic molecule
Emp. Form.:
C15H13NO4S
Mol. Mass.:
303.333
SMILES:
Cc1ccc(cc1)-c1c(C(O)=O)c(C(O)=O)c2CSCn12
: