Target
Beta-lactamase
Ligand
BDBM52024
Substrate
Meas. Tech.
FRET-based counterscreen for selective VIM-2 inhibitors: dose response biochemical high throughput screening assay to identify epi-absorbance assay artifacts.
IC50
8619±n/a nM
Citation
 PubChem, PC FRET-based counterscreen for selective VIM-2 inhibitors: dose response biochemical high throughput screening assay to identify epi-absorbance assay artifacts. PubChem Bioassay (2009)[AID] 
Target
Name:
Beta-lactamase
Synonyms:
Beta lactamase
Type:
Enzyme Catalytic Domain
Mol. Mass.:
31513.38
Organism:
Pseudomonas aeruginosa
Description:
gi_114881106
Residue:
286
  
Inhibitor
Name:
BDBM52024
Synonyms:
2-[2-[(3-cyclohexyl-5-sulfanylidene-1H-1,2,4-triazol-4-yl)iminomethyl]phenoxy]acetic acid 2-[2-[(3-cyclohexyl-5-thioxo-1H-1,2,4-triazol-4-yl)iminomethyl]phenoxy]acetic acid SMR000540197 | cid_1384708
Type:
Small organic molecule
Emp. Form.:
C17H20N4O3S
Mol. Mass.:
360.431
SMILES:
OC(=O)COc1ccccc1C=Nn1c(n[nH]c1=S)C1CCCCC1
: