Target
Beta-lactamase
Ligand
BDBM52044
Substrate
Meas. Tech.
FRET-based counterscreen for selective VIM-2 inhibitors: dose response biochemical high throughput screening assay to identify epi-absorbance assay artifacts.
IC50
3653±n/a nM
Citation
 PubChem, PC FRET-based counterscreen for selective VIM-2 inhibitors: dose response biochemical high throughput screening assay to identify epi-absorbance assay artifacts. PubChem Bioassay (2009)[AID] 
Target
Name:
Beta-lactamase
Synonyms:
Beta lactamase
Type:
Enzyme Catalytic Domain
Mol. Mass.:
31513.38
Organism:
Pseudomonas aeruginosa
Description:
gi_114881106
Residue:
286
  
Inhibitor
Name:
BDBM52044
Synonyms:
2-fluoranyl-N-[5-[2-[(4-fluorophenyl)methylamino]-2-oxidanylidene-ethyl]sulfanyl-1,3,4-thiadiazol-2-yl]benzamide 2-fluoro-N-[5-[[2-[(4-fluorobenzyl)amino]-2-keto-ethyl]thio]-1,3,4-thiadiazol-2-yl]benzamide MLS001232843 cid_18561114
Type:
Small organic molecule
Emp. Form.:
C18H14F2N4O2S2
Mol. Mass.:
420.456
SMILES:
Fc1ccc(CNC(=O)CSc2nnc(NC(=O)c3ccccc3F)s2)cc1
: