Target
Beta-lactamase
Ligand
BDBM39597
Substrate
Meas. Tech.
FRET-based counterscreen for selective VIM-2 inhibitors: dose response biochemical high throughput screening assay to identify inhibitors of IMP-1 metallo-beta-lactamase.
IC50
59640±n/a nM
Citation
 PubChem, PC FRET-based counterscreen for selective VIM-2 inhibitors: dose response biochemical high throughput screening assay to identify inhibitors of IMP-1 metallo-beta-lactamase. PubChem Bioassay (2009)[AID] 
Target
Name:
Beta-lactamase
Synonyms:
Beta-lactamase | metallo-beta-lactamase IMP-1
Type:
Enzyme Catalytic Domain
Mol. Mass.:
27125.88
Organism:
Pseudomonas aeruginosa
Description:
gi_27368096
Residue:
246
  
Inhibitor
Name:
BDBM39597
Synonyms:
(2-benzoxyphenyl)phosphonic acid MLS000041815 cid_279160
Type:
Small organic molecule
Emp. Form.:
C13H13O4P
Mol. Mass.:
264.2137
SMILES:
OP(O)(=O)c1ccccc1OCc1ccccc1
: