Target
Beta-lactamase
Ligand
BDBM51688
Substrate
Meas. Tech.
FRET-based counterscreen for selective VIM-2 inhibitors: dose response biochemical high throughput screening assay to identify inhibitors of IMP-1 metallo-beta-lactamase.
IC50
59640±n/a nM
Citation
 PubChem, PC FRET-based counterscreen for selective VIM-2 inhibitors: dose response biochemical high throughput screening assay to identify inhibitors of IMP-1 metallo-beta-lactamase. PubChem Bioassay (2009)[AID] 
Target
Name:
Beta-lactamase
Synonyms:
Beta-lactamase | metallo-beta-lactamase IMP-1
Type:
Enzyme Catalytic Domain
Mol. Mass.:
27125.88
Organism:
Pseudomonas aeruginosa
Description:
gi_27368096
Residue:
246
  
Inhibitor
Name:
BDBM51688
Synonyms:
(3-Methyl-5-oxo-4,5-dihydro-1H-pyrazol-4-yl)-acetic acid [1-(2,5-dimethoxy-phenyl)-meth-(E)-ylidene]-hydrazide N-[(2,5-dimethoxybenzylidene)amino]-2-(3-keto-5-methyl-2-pyrazolin-4-yl)acetamide N-[(2,5-dimethoxyphenyl)methylideneamino]-2-(3-methyl-5-oxo-1,4-dihydropyrazol-4-yl)acetamide cid_3795446
Type:
Small organic molecule
Emp. Form.:
C15H18N4O4
Mol. Mass.:
318.3278
SMILES:
COc1ccc(OC)c(C=NNC(=O)Cc2c(C)[nH][nH]c2=O)c1
: