Target
Beta-lactamase
Ligand
BDBM52021
Substrate
Meas. Tech.
FRET-based counterscreen for selective VIM-2 inhibitors: dose response biochemical high throughput screening assay to identify inhibitors of IMP-1 metallo-beta-lactamase.
IC50
59640±n/a nM
Citation
 PubChem, PC FRET-based counterscreen for selective VIM-2 inhibitors: dose response biochemical high throughput screening assay to identify inhibitors of IMP-1 metallo-beta-lactamase. PubChem Bioassay (2009)[AID] 
Target
Name:
Beta-lactamase
Synonyms:
Beta-lactamase | metallo-beta-lactamase IMP-1
Type:
Enzyme Catalytic Domain
Mol. Mass.:
27125.88
Organism:
Pseudomonas aeruginosa
Description:
gi_27368096
Residue:
246
  
Inhibitor
Name:
BDBM52021
Synonyms:
(2S)-2-[2-[(8,8-dimethyl-2-oxidanylidene-4-propyl-9,10-dihydropyrano[2,3-h]chromen-5-yl)oxy]ethanoylamino]propanoic acid (2S)-2-[[2-[(8,8-dimethyl-2-oxo-4-propyl-9,10-dihydropyrano[2,3-h][1]benzopyran-5-yl)oxy]-1-oxoethyl]amino]propanoic acid MLS001201773 cid_8016786
Type:
Small organic molecule
Emp. Form.:
C22H27NO7
Mol. Mass.:
417.4523
SMILES:
CCCc1cc(=O)oc2c3CCC(C)(C)Oc3cc(OCC(=O)N[C@@H](C)C(O)=O)c12
: