Target
Beta-lactamase
Ligand
BDBM52032
Substrate
Meas. Tech.
FRET-based counterscreen for selective VIM-2 inhibitors: dose response biochemical high throughput screening assay to identify inhibitors of IMP-1 metallo-beta-lactamase.
IC50
59640±n/a nM
Citation
 PubChem, PC FRET-based counterscreen for selective VIM-2 inhibitors: dose response biochemical high throughput screening assay to identify inhibitors of IMP-1 metallo-beta-lactamase. PubChem Bioassay (2009)[AID] 
Target
Name:
Beta-lactamase
Synonyms:
Beta-lactamase | metallo-beta-lactamase IMP-1
Type:
Enzyme Catalytic Domain
Mol. Mass.:
27125.88
Organism:
Pseudomonas aeruginosa
Description:
gi_27368096
Residue:
246
  
Inhibitor
Name:
BDBM52032
Synonyms:
2-(2,5-dimethoxyphenyl)-3-(furan-2-carbonyl)-4-hydroxy-1-(pyridin-3-ylmethyl)-2H-pyrrol-5-one 2-(2,5-dimethoxyphenyl)-3-[2-furanyl(oxo)methyl]-4-hydroxy-1-(3-pyridinylmethyl)-2H-pyrrol-5-one MLS001034298 cid_2951249
Type:
Small organic molecule
Emp. Form.:
C23H20N2O6
Mol. Mass.:
420.4147
SMILES:
COc1ccc(OC)c(c1)C1C(C(=O)c2ccco2)C(=O)C(=O)N1Cc1cccnc1
: