Target
Zinc finger protein mex-5
Ligand
BDBM52063
Substrate
Meas. Tech.
Fluorescent Polarization Homogeneous Dose Response HTS to Indentify Inhibitors of Mex-5 Binding to TCR-2
EC50
26016±n/a nM
Citation
 PubChem, PC Fluorescent Polarization Homogeneous Dose Response HTS to Indentify Inhibitors of Mex-5 Binding to TCR-2 PubChem Bioassay (2009)[AID] 
Target
Name:
Zinc finger protein mex-5
Synonyms:
MEX5_CAEEL mex-5
Type:
Enzyme Catalytic Domain
Mol. Mass.:
52832.78
Organism:
Caenorhabditis elegans
Description:
gi_55976631
Residue:
468
  
Inhibitor
Name:
BDBM52063
Synonyms:
MLS000075648 N-(4-methyl-6-propionamido-3-pyridyl)-3-phenyl-propionamide N-[4-methyl-6-(propanoylamino)pyridin-3-yl]-3-phenyl-propanamide SMR000005482 | cid_647472
Type:
Small organic molecule
Emp. Form.:
C18H21N3O2
Mol. Mass.:
311.3782
SMILES:
CCC(=O)Nc1cc(C)c(NC(=O)CCc2ccccc2)cn1
: