Target
Zinc finger protein mex-5
Ligand
BDBM52191
Substrate
Meas. Tech.
Fluorescent Polarization Homogeneous Dose Response HTS to Indentify Inhibitors of Mex-5 Binding to TCR-2
EC50
33720±n/a nM
Citation
 PubChem, PC Fluorescent Polarization Homogeneous Dose Response HTS to Indentify Inhibitors of Mex-5 Binding to TCR-2 PubChem Bioassay (2009)[AID] 
Target
Name:
Zinc finger protein mex-5
Synonyms:
MEX5_CAEEL mex-5
Type:
Enzyme Catalytic Domain
Mol. Mass.:
52832.78
Organism:
Caenorhabditis elegans
Description:
gi_55976631
Residue:
468
  
Inhibitor
Name:
BDBM52191
Synonyms:
MLS000118418 [4-(2,5-dimethylphenyl)-1-piperazinyl]-(2-pyrazolo[1,5-a]pyridinyl)methanone [4-(2,5-dimethylphenyl)piperazin-1-yl]-pyrazolo[1,5-a]pyridin-2-ylmethanone cid_5307468
Type:
Small organic molecule
Emp. Form.:
C20H22N4O
Mol. Mass.:
334.4149
SMILES:
Cc1ccc(C)c(c1)N1CCN(CC1)C(=O)c1cc2ccccn2n1
: