Target
Zinc finger protein mex-5
Ligand
BDBM47136
Substrate
Meas. Tech.
Fluorescent Polarization Homogeneous Dose Response HTS to Indentify Inhibitors of Mex-5 Binding to TCR-2
EC50
32853±n/a nM
Citation
 PubChem, PC Fluorescent Polarization Homogeneous Dose Response HTS to Indentify Inhibitors of Mex-5 Binding to TCR-2 PubChem Bioassay (2009)[AID] 
Target
Name:
Zinc finger protein mex-5
Synonyms:
MEX5_CAEEL mex-5
Type:
Enzyme Catalytic Domain
Mol. Mass.:
52832.78
Organism:
Caenorhabditis elegans
Description:
gi_55976631
Residue:
468
  
Inhibitor
Name:
BDBM47136
Synonyms:
2-(4-fluorophenyl)-3-(furan-2-carbonyl)-4-hydroxy-1-(5-methyl-1,3,4-thiadiazol-2-yl)-2H-pyrrol-5-one 2-(4-fluorophenyl)-3-[2-furanyl(oxo)methyl]-4-hydroxy-1-(5-methyl-1,3,4-thiadiazol-2-yl)-2H-pyrrol-5-one MLS000114263 cid_2913184
Type:
Small organic molecule
Emp. Form.:
C18H12FN3O4S
Mol. Mass.:
385.369
SMILES:
Cc1nnc(s1)N1C(C(C(=O)c2ccco2)C(=O)C1=O)c1ccc(F)cc1
: