Target
Zinc finger protein mex-5
Ligand
BDBM51068
Substrate
Meas. Tech.
Fluorescent Polarization Homogeneous Dose Response HTS to Indentify Inhibitors of Mex-5 Binding to TCR-2
EC50
25756±n/a nM
Citation
 PubChem, PC Fluorescent Polarization Homogeneous Dose Response HTS to Indentify Inhibitors of Mex-5 Binding to TCR-2 PubChem Bioassay (2009)[AID] 
Target
Name:
Zinc finger protein mex-5
Synonyms:
MEX5_CAEEL mex-5
Type:
Enzyme Catalytic Domain
Mol. Mass.:
52832.78
Organism:
Caenorhabditis elegans
Description:
gi_55976631
Residue:
468
  
Inhibitor
Name:
BDBM51068
Synonyms:
1-chloro-5-methyl-4-phenyl-cyclopenta[c]quinolizine-2,3-dicarboxylic acid dimethyl ester MLS000700795 cid_1234827 dimethyl 1-chloro-5-methyl-4-phenylcyclopenta[c]quinolizine-2,3-dicarboxylate
Type:
Small organic molecule
Emp. Form.:
C23H18ClNO4
Mol. Mass.:
407.846
SMILES:
COC(=O)c1c(Cl)c2c(c1C(=O)OC)c(-c1ccccc1)c(C)c1ccccn21
: