Target
Zinc finger protein mex-5
Ligand
BDBM51075
Substrate
Meas. Tech.
Fluorescent Polarization Homogeneous Dose Response HTS to Indentify Inhibitors of Mex-5 Binding to TCR-2
EC50
38486±n/a nM
Citation
 PubChem, PC Fluorescent Polarization Homogeneous Dose Response HTS to Indentify Inhibitors of Mex-5 Binding to TCR-2 PubChem Bioassay (2009)[AID] 
Target
Name:
Zinc finger protein mex-5
Synonyms:
MEX5_CAEEL mex-5
Type:
Enzyme Catalytic Domain
Mol. Mass.:
52832.78
Organism:
Caenorhabditis elegans
Description:
gi_55976631
Residue:
468
  
Inhibitor
Name:
BDBM51075
Synonyms:
2-[[[(Z)-[2-keto-4-(3-methylpyridin-1-ium-1-yl)-3-thiazolin-5-ylidene]methyl]amino]carbamoyl]phenolate 2-[[[(Z)-[4-(3-methylpyridin-1-ium-1-yl)-2-oxidanylidene-1,3-thiazol-5-ylidene]methyl]amino]carbamoyl]phenolate MLS000589575 cid_15944865
Type:
Small organic molecule
Emp. Form.:
C17H14N4O3S
Mol. Mass.:
354.383
SMILES:
Cc1ccc[n+](c1)-c1[nH]c(=O)sc1C=NNC(=O)c1ccccc1[O-]
: