Target
Zinc finger protein mex-5
Ligand
BDBM52488
Substrate
Meas. Tech.
Fluorescent Polarization Homogeneous Dose Response HTS to Indentify Inhibitors of Mex-5 Binding to TCR-2
EC50
25775±n/a nM
Citation
 PubChem, PC Fluorescent Polarization Homogeneous Dose Response HTS to Indentify Inhibitors of Mex-5 Binding to TCR-2 PubChem Bioassay (2009)[AID] 
Target
Name:
Zinc finger protein mex-5
Synonyms:
MEX5_CAEEL mex-5
Type:
Enzyme Catalytic Domain
Mol. Mass.:
52832.78
Organism:
Caenorhabditis elegans
Description:
gi_55976631
Residue:
468
  
Inhibitor
Name:
BDBM52488
Synonyms:
(E)-2-cyano-3-[5-[4-(difluoromethylsulfanyl)phenyl]furan-2-yl]-N-(5-methyl-2-phenylpyrazol-3-yl)prop-2-enamide (E)-2-cyano-3-[5-[4-(difluoromethylthio)phenyl]-2-furyl]-N-(5-methyl-2-phenyl-pyrazol-3-yl)acrylamide MLS000391890 cid_6011596
Type:
Small organic molecule
Emp. Form.:
C25H18F2N4O2S
Mol. Mass.:
476.498
SMILES:
Cc1cc(NC(=O)C(=C\c2ccc(o2)-c2ccc(SC(F)F)cc2)\C#N)n(n1)-c1ccccc1
: