Target
Zinc finger protein mex-5
Ligand
BDBM46591
Substrate
Meas. Tech.
Fluorescent Polarization Homogeneous Dose Response HTS to Indentify Inhibitors of Mex-5 Binding to TCR-2
EC50
1375±n/a nM
Citation
 PubChem, PC Fluorescent Polarization Homogeneous Dose Response HTS to Indentify Inhibitors of Mex-5 Binding to TCR-2 PubChem Bioassay (2009)[AID] 
Target
Name:
Zinc finger protein mex-5
Synonyms:
MEX5_CAEEL mex-5
Type:
Enzyme Catalytic Domain
Mol. Mass.:
52832.78
Organism:
Caenorhabditis elegans
Description:
gi_55976631
Residue:
468
  
Inhibitor
Name:
BDBM46591
Synonyms:
2-chloranyl-4-[5-[(Z)-2-[(5-methyl-1H-1,2,4-triazol-3-yl)sulfanyl]-3-oxidanyl-3-oxidanylidene-prop-1-enyl]furan-2-yl]benzoic acid 4-[5-[(Z)-2-carboxy-2-[(5-methyl-1H-1,2,4-triazol-3-yl)thio]ethenyl]-2-furanyl]-2-chlorobenzoic acid 4-{5-[(Z)-2-Carboxy-2-(5-methyl-4H-[1,2,4]triazol-3-ylsulfanyl)-vinyl]-furan-2-yl}-2-chloro-benzoic acid SMR000415298 | cid_1625680
Type:
Small organic molecule
Emp. Form.:
C17H12ClN3O5S
Mol. Mass.:
405.812
SMILES:
Cc1nnc(SC(=Cc2ccc(o2)-c2ccc(C(O)=O)c(Cl)c2)C(O)=O)[nH]1
: