Target
Zinc finger protein mex-5
Ligand
BDBM52887
Substrate
Meas. Tech.
Fluorescent Polarization Homogeneous Dose Response HTS to Indentify Inhibitors of Mex-5 Binding to TCR-2
EC50
16962±n/a nM
Citation
 PubChem, PC Fluorescent Polarization Homogeneous Dose Response HTS to Indentify Inhibitors of Mex-5 Binding to TCR-2 PubChem Bioassay (2009)[AID] 
Target
Name:
Zinc finger protein mex-5
Synonyms:
MEX5_CAEEL mex-5
Type:
Enzyme Catalytic Domain
Mol. Mass.:
52832.78
Organism:
Caenorhabditis elegans
Description:
gi_55976631
Residue:
468
  
Inhibitor
Name:
BDBM52887
Synonyms:
4-O-[3-[(E)-3-methoxyprop-1-enyl]-7-methyl-6,8-dioxoisochromen-7-yl] 1-O-methyl butanedioate MLS000438854 SMR000452618 cid_16745661 | succinic acid O4-[6,8-diketo-3-[(E)-3-methoxyprop-1-enyl]-7-methyl-isochromen-7-yl] ester O1-methyl ester
Type:
Small organic molecule
Emp. Form.:
C19H20O8
Mol. Mass.:
376.3573
SMILES:
COC\C=C\C1=CC2=CC(=O)C(C)(OC(=O)CCC(=O)OC)C(=O)C2=CO1
: