Target
Zinc finger protein mex-5
Ligand
BDBM53102
Substrate
Meas. Tech.
Fluorescent Polarization Homogeneous Dose Response HTS to Indentify Inhibitors of Mex-5 Binding to TCR-2
EC50
14832±n/a nM
Citation
 PubChem, PC Fluorescent Polarization Homogeneous Dose Response HTS to Indentify Inhibitors of Mex-5 Binding to TCR-2 PubChem Bioassay (2009)[AID] 
Target
Name:
Zinc finger protein mex-5
Synonyms:
MEX5_CAEEL mex-5
Type:
Enzyme Catalytic Domain
Mol. Mass.:
52832.78
Organism:
Caenorhabditis elegans
Description:
gi_55976631
Residue:
468
  
Inhibitor
Name:
BDBM53102
Synonyms:
MLS001164912 N,10-dimethylphenazin-10-ium-2-amine;perchlorate cid_10860295 | methyl-(10-methylphenazin-10-ium-2-yl)amine;perchlorate
Type:
Small organic molecule
Emp. Form.:
C14H14N3
Mol. Mass.:
224.2805
SMILES:
C\[NH+]=c1/ccc2nc3ccccc3n(C)c2c1
: