Target
POsterior Segregation
Ligand
BDBM23412
Substrate
Meas. Tech.
Fluorescent Polarization Homogeneous Dose Response HTS to Indentify Inhibitors of POS-1 Binding to mex-3-RNA
EC50
93141±n/a nM
Citation
 PubChem, PC Fluorescent Polarization Homogeneous Dose Response HTS to Indentify Inhibitors of POS-1 Binding to mex-3-RNA PubChem Bioassay (2009)[AID] 
Target
Name:
POsterior Segregation
Synonyms:
POsterior Segregation family member (pos-1)
Type:
Enzyme Catalytic Domain
Mol. Mass.:
29838.90
Organism:
Caenorhabditis elegans
Description:
gi_17562800
Residue:
264
  
Inhibitor
Name:
BDBM23412
Synonyms:
2-(3,4-dihydroxyphenyl)-5,7-dihydroxy-6-methoxy-4H-chromen-4-one CHEMBL172350 cid_5317284
Type:
flavone
Emp. Form.:
C16H12O7
Mol. Mass.:
316.2623
SMILES:
COc1c(O)cc2oc(cc(=O)c2c1O)-c1ccc(O)c(O)c1
: