Target
POsterior Segregation
Ligand
BDBM52891
Substrate
Meas. Tech.
Fluorescent Polarization Homogeneous Dose Response HTS to Indentify Inhibitors of POS-1 Binding to mex-3-RNA
EC50
300000±n/a nM
Citation
 PubChem, PC Fluorescent Polarization Homogeneous Dose Response HTS to Indentify Inhibitors of POS-1 Binding to mex-3-RNA PubChem Bioassay (2009)[AID] 
Target
Name:
POsterior Segregation
Synonyms:
POsterior Segregation family member (pos-1)
Type:
Enzyme Catalytic Domain
Mol. Mass.:
29838.90
Organism:
Caenorhabditis elegans
Description:
gi_17562800
Residue:
264
  
Inhibitor
Name:
BDBM52891
Synonyms:
2-furancarboxylic acid [5-bromo-3-(4-methoxyphenyl)-7-methyl-6,8-dioxo-2-benzopyran-7-yl] ester MLS000438313 [5-bromanyl-3-(4-methoxyphenyl)-7-methyl-6,8-bis(oxidanylidene)isochromen-7-yl] furan-2-carboxylate cid_16745665 | furan-2-carboxylic acid [5-bromo-6,8-diketo-3-(4-methoxyphenyl)-7-methyl-isochromen-7-yl] ester
Type:
Small organic molecule
Emp. Form.:
C22H15BrO7
Mol. Mass.:
471.254
SMILES:
COc1ccc(cc1)C1=CC2=C(Br)C(=O)C(C)(OC(=O)c3ccco3)C(=O)C2=CO1
: