Target
POsterior Segregation
Ligand
BDBM53063
Substrate
Meas. Tech.
Fluorescent Polarization Homogeneous Dose Response HTS to Indentify Inhibitors of POS-1 Binding to mex-3-RNA
EC50
300000±n/a nM
Citation
 PubChem, PC Fluorescent Polarization Homogeneous Dose Response HTS to Indentify Inhibitors of POS-1 Binding to mex-3-RNA PubChem Bioassay (2009)[AID] 
Target
Name:
POsterior Segregation
Synonyms:
POsterior Segregation family member (pos-1)
Type:
Enzyme Catalytic Domain
Mol. Mass.:
29838.90
Organism:
Caenorhabditis elegans
Description:
gi_17562800
Residue:
264
  
Inhibitor
Name:
BDBM53063
Synonyms:
(5Z)-3-allyl-5-(3-ethyl-5-methoxy-1,3-benzothiazol-2-ylidene)-2-thioxo-thiazolidin-4-one (5Z)-5-(3-ethyl-5-methoxy-1,3-benzothiazol-2-ylidene)-3-prop-2-enyl-2-sulfanylidene-4-thiazolidinone MLS001209520 cid_3115306
Type:
Small organic molecule
Emp. Form.:
C16H16N2O2S3
Mol. Mass.:
364.505
SMILES:
CCN1\C(Sc2ccc(OC)cc12)=C1\SC(=S)N(CC=C)C1=O
: