Target
POsterior Segregation
Ligand
BDBM53223
Substrate
Meas. Tech.
Fluorescent Polarization Homogeneous Dose Response HTS to Indentify Inhibitors of POS-1 Binding to mex-3-RNA
EC50
300000±n/a nM
Citation
 PubChem, PC Fluorescent Polarization Homogeneous Dose Response HTS to Indentify Inhibitors of POS-1 Binding to mex-3-RNA PubChem Bioassay (2009)[AID] 
Target
Name:
POsterior Segregation
Synonyms:
POsterior Segregation family member (pos-1)
Type:
Enzyme Catalytic Domain
Mol. Mass.:
29838.90
Organism:
Caenorhabditis elegans
Description:
gi_17562800
Residue:
264
  
Inhibitor
Name:
BDBM53223
Synonyms:
(5E)-5-[[5-(dimethylamino)-2-furanyl]methylidene]-1-(4-methoxyphenyl)-2-sulfanylidene-1,3-diazinane-4,6-dione (5E)-5-[[5-(dimethylamino)furan-2-yl]methylidene]-1-(4-methoxyphenyl)-2-sulfanylidene-1,3-diazinane-4,6-dione MLS001196407 cid_24762090
Type:
Small organic molecule
Emp. Form.:
C18H17N3O4S
Mol. Mass.:
371.41
SMILES:
COc1ccc(cc1)N1C(=S)NC(=O)C(=Cc2ccc(o2)N(C)C)C1=O
: