Target
POsterior Segregation
Ligand
BDBM39721
Substrate
Meas. Tech.
Fluorescent Polarization Homogeneous Dose Response HTS to Indentify Inhibitors of POS-1 Binding to mex-3-RNA
EC50
16731±n/a nM
Citation
 PubChem, PC Fluorescent Polarization Homogeneous Dose Response HTS to Indentify Inhibitors of POS-1 Binding to mex-3-RNA PubChem Bioassay (2009)[AID] 
Target
Name:
POsterior Segregation
Synonyms:
POsterior Segregation family member (pos-1)
Type:
Enzyme Catalytic Domain
Mol. Mass.:
29838.90
Organism:
Caenorhabditis elegans
Description:
gi_17562800
Residue:
264
  
Inhibitor
Name:
BDBM39721
Synonyms:
5-({1-[2-(1,3-benzodioxol-5-yloxy)ethyl]-1H-indol-3-yl}methylene)-2,4,6(1H,3H,5H)-pyrimidinetrione 5-[[1-[2-(1,3-benzodioxol-5-yloxy)ethyl]indol-3-yl]methylene]barbituric acid MLS000534541 cid_1257866
Type:
Small organic molecule
Emp. Form.:
C22H17N3O6
Mol. Mass.:
419.3869
SMILES:
O=[#6]-1-[#7]-[#6](=O)\[#6](=[#6]\c2cn(-[#6]-[#6]-[#8]-c3ccc4-[#8]-[#6]-[#8]-c4c3)c3ccccc23)-[#6](=O)-[#7]-1
: