Target
POsterior Segregation
Ligand
BDBM52359
Substrate
Meas. Tech.
Fluorescent Polarization Homogeneous Dose Response HTS to Indentify Inhibitors of POS-1 Binding to mex-3-RNA
EC50
300000±n/a nM
Citation
 PubChem, PC Fluorescent Polarization Homogeneous Dose Response HTS to Indentify Inhibitors of POS-1 Binding to mex-3-RNA PubChem Bioassay (2009)[AID] 
Target
Name:
POsterior Segregation
Synonyms:
POsterior Segregation family member (pos-1)
Type:
Enzyme Catalytic Domain
Mol. Mass.:
29838.90
Organism:
Caenorhabditis elegans
Description:
gi_17562800
Residue:
264
  
Inhibitor
Name:
BDBM52359
Synonyms:
(6E)-5-azanylidene-6-[[5-(furan-2-ylmethylsulfanyl)furan-2-yl]methylidene]-[1,3,4]thiadiazolo[3,2-a]pyrimidin-7-one (6E)-6-[[5-(2-furfurylthio)-2-furyl]methylene]-5-imino-[1,3,4]thiadiazolo[3,2-a]pyrimidin-7-one MLS000520306 cid_11957177
Type:
Small organic molecule
Emp. Form.:
C15H10N4O3S2
Mol. Mass.:
358.395
SMILES:
N=C1N2N=CSC2=NC(=O)\C1=C\c1ccc(SCc2ccco2)o1
: