Target
POsterior Segregation
Ligand
BDBM41095
Substrate
Meas. Tech.
Fluorescent Polarization Homogeneous Dose Response HTS to Indentify Inhibitors of POS-1 Binding to mex-3-RNA
EC50
300000±n/a nM
Citation
 PubChem, PC Fluorescent Polarization Homogeneous Dose Response HTS to Indentify Inhibitors of POS-1 Binding to mex-3-RNA PubChem Bioassay (2009)[AID] 
Target
Name:
POsterior Segregation
Synonyms:
POsterior Segregation family member (pos-1)
Type:
Enzyme Catalytic Domain
Mol. Mass.:
29838.90
Organism:
Caenorhabditis elegans
Description:
gi_17562800
Residue:
264
  
Inhibitor
Name:
BDBM41095
Synonyms:
5-[[4-[(E)-2-(1H-benzimidazol-2-yl)-2-cyano-vinyl]-2-methoxy-phenoxy]methyl]furan-2-carboxylic acid methyl ester MLS000581749 cid_5740525 methyl 5-[[4-[(E)-2-(1H-benzimidazol-2-yl)-2-cyano-ethenyl]-2-methoxy-phenoxy]methyl]furan-2-carboxylate | methyl 5-[[4-[(E)-2-(1H-benzimidazol-2-yl)-2-cyanoethenyl]-2-methoxyphenoxy]methyl]furan-2-carboxylate
Type:
Small organic molecule
Emp. Form.:
C24H19N3O5
Mol. Mass.:
429.4248
SMILES:
COC(=O)c1ccc(COc2ccc(\C=C(/C#N)c3nc4ccccc4[nH]3)cc2OC)o1
: