Target
Dual specificity protein phosphatase 6
Ligand
BDBM35430
Substrate
Meas. Tech.
MKP-3 in vitro HTS assay
IC50
36800±n/a nM
Citation
 PubChem, PC MKP-3 in vitro HTS assay PubChem Bioassay (2009)[AID] 
Target
Name:
Dual specificity protein phosphatase 6
Synonyms:
DUS6_RAT MAP kinase phosphatase 3 Mitogen-activated protein kinase phosphatase 3 | Mkp3
Type:
Enzyme
Mol. Mass.:
42303.19
Organism:
Rattus norvegicus
Description:
gi_16758752
Residue:
381
  
Inhibitor
Name:
BDBM35430
Synonyms:
2-[(6-ethoxy-4-methyl-2-quinazolinyl)amino]-1,5,6,7-tetrahydrocyclopenta[d]pyrimidin-4-one 2-[(6-ethoxy-4-methylquinazolin-2-yl)amino]-1,5,6,7-tetrahydrocyclopenta[d]pyrimidin-4-one SMR000091842 | cid_707172
Type:
Small organic molecule
Emp. Form.:
C18H19N5O2
Mol. Mass.:
337.3758
SMILES:
CCOc1ccc2nc(Nc3nc4CCCc4c(=O)[nH]3)nc(C)c2c1
: