Target
Dual specificity protein phosphatase 6
Ligand
BDBM50422
Substrate
Meas. Tech.
MKP-3 in vitro HTS assay
IC50
25800±n/a nM
Citation
 PubChem, PC MKP-3 in vitro HTS assay PubChem Bioassay (2009)[AID] 
Target
Name:
Dual specificity protein phosphatase 6
Synonyms:
DUS6_RAT MAP kinase phosphatase 3 Mitogen-activated protein kinase phosphatase 3 | Mkp3
Type:
Enzyme
Mol. Mass.:
42303.19
Organism:
Rattus norvegicus
Description:
gi_16758752
Residue:
381
  
Inhibitor
Name:
BDBM50422
Synonyms:
4-[[5-(5,6-dimethyl-1H-benzimidazol-2-yl)pyridin-2-yl]sulfanylmethyl]benzoic acid 4-[[[5-(5,6-dimethyl-1H-benzimidazol-2-yl)-2-pyridyl]thio]methyl]benzoic acid SMR000277370 | cid_1432813
Type:
Small organic molecule
Emp. Form.:
C22H19N3O2S
Mol. Mass.:
389.47
SMILES:
Cc1cc2nc([nH]c2cc1C)-c1ccc(SCc2ccc(cc2)C(O)=O)nc1
: