Target
Dual specificity protein phosphatase 6
Ligand
BDBM51773
Substrate
Meas. Tech.
MKP-3 in vitro HTS assay
IC50
17200±n/a nM
Citation
 PubChem, PC MKP-3 in vitro HTS assay PubChem Bioassay (2009)[AID] 
Target
Name:
Dual specificity protein phosphatase 6
Synonyms:
DUS6_RAT MAP kinase phosphatase 3 Mitogen-activated protein kinase phosphatase 3 | Mkp3
Type:
Enzyme
Mol. Mass.:
42303.19
Organism:
Rattus norvegicus
Description:
gi_16758752
Residue:
381
  
Inhibitor
Name:
BDBM51773
Synonyms:
3-[2-({3-[2-(3,4-dimethylanilino)-2-oxoethyl]-2,4-dioxo-1,3-thiazolidin-5-ylidene}methyl)-1H-pyrrol-1-yl]benzoic acid 3-[2-[(Z)-[3-[2-(3,4-dimethylanilino)-2-oxoethyl]-2,4-dioxo-1,3-thiazolidin-5-ylidene]methyl]pyrrol-1-yl]benzoic acid 3-[2-[(Z)-[3-[2-[(3,4-dimethylphenyl)amino]-2-oxidanylidene-ethyl]-2,4-bis(oxidanylidene)-1,3-thiazolidin-5-ylidene]methyl]pyrrol-1-yl]benzoic acid SMR000231568 | cid_1721856
Type:
Small organic molecule
Emp. Form.:
C25H21N3O5S
Mol. Mass.:
475.516
SMILES:
Cc1ccc(NC(=O)CN2C(=O)S\C(=C/c3cccn3-c3cccc(c3)C(O)=O)C2=O)cc1C
: