Target
Dual specificity protein phosphatase 6
Ligand
BDBM48873
Substrate
Meas. Tech.
MKP-3 in vitro HTS assay
IC50
10100±n/a nM
Citation
 PubChem, PC MKP-3 in vitro HTS assay PubChem Bioassay (2009)[AID] 
Target
Name:
Dual specificity protein phosphatase 6
Synonyms:
DUS6_RAT MAP kinase phosphatase 3 Mitogen-activated protein kinase phosphatase 3 | Mkp3
Type:
Enzyme
Mol. Mass.:
42303.19
Organism:
Rattus norvegicus
Description:
gi_16758752
Residue:
381
  
Inhibitor
Name:
BDBM48873
Synonyms:
4-[({[2-(4-fluorophenyl)-5H-chromeno[2,3-d]pyrimidin-4-yl]thio}acetyl)amino]benzoic acid 4-[[2-[[2-(4-fluorophenyl)-5H-[1]benzopyrano[2,3-d]pyrimidin-4-yl]thio]-1-oxoethyl]amino]benzoic acid 4-[[2-[[2-(4-fluorophenyl)-5H-chromeno[2,3-d]pyrimidin-4-yl]thio]acetyl]amino]benzoic acid SMR000314286 | cid_2137362
Type:
Small organic molecule
Emp. Form.:
C26H18FN3O4S
Mol. Mass.:
487.502
SMILES:
OC(=O)c1ccc(NC(=O)CSc2nc(nc3Oc4ccccc4Cc23)-c2ccc(F)cc2)cc1
: