Target
Tyrosine-protein phosphatase non-receptor type 7
Ligand
BDBM53540
Substrate
Meas. Tech.
HTS Discovery of Chemical Inhibitors of HePTP, a Leukemia Target
IC50
100000±n/a nM
Citation
 PubChem, PC HTS Discovery of Chemical Inhibitors of HePTP, a Leukemia Target PubChem Bioassay (2008)[AID] 
Target
Name:
Tyrosine-protein phosphatase non-receptor type 7
Synonyms:
He-PTP Hematopoietic protein-tyrosine phosphatase (HEPTP) PTPN7 Tyrosine-protein phosphatase non-receptor type 7 | Tyrosine-protein phosphatase non-receptor type 7 (HEPTP)
Type:
Protein
Mol. Mass.:
40530.79
Organism:
Homo sapiens (Human)
Description:
P35236
Residue:
360
  
Inhibitor
Name:
BDBM53540
Synonyms:
1-[(2-methoxyphenyl)methyl]-3-thiophen-2-yl-urea 1-o-anisyl-3-(2-thienyl)urea N-(2-methoxybenzyl)-N'-thien-2-ylurea cid_3235778
Type:
Small organic molecule
Emp. Form.:
C13H14N2O2S
Mol. Mass.:
262.327
SMILES:
COc1ccccc1CNC(=O)Nc1cccs1
: