Target
Tyrosine-protein phosphatase non-receptor type 7
Ligand
BDBM40987
Substrate
Meas. Tech.
HTS Discovery of Chemical Inhibitors of HePTP, a Leukemia Target
IC50
5280±n/a nM
Citation
 PubChem, PC HTS Discovery of Chemical Inhibitors of HePTP, a Leukemia Target PubChem Bioassay (2008)[AID] 
Target
Name:
Tyrosine-protein phosphatase non-receptor type 7
Synonyms:
He-PTP Hematopoietic protein-tyrosine phosphatase (HEPTP) PTPN7 Tyrosine-protein phosphatase non-receptor type 7 | Tyrosine-protein phosphatase non-receptor type 7 (HEPTP)
Type:
Protein
Mol. Mass.:
40530.79
Organism:
Homo sapiens (Human)
Description:
P35236
Residue:
360
  
Inhibitor
Name:
BDBM40987
Synonyms:
MLS000109444 N-[(4Z)-4-(3H-1,3-benzoxazol-2-ylidene)-3-keto-cyclohexa-1,5-dien-1-yl]-2-(4-ethylphenoxy)acetamide N-[(4Z)-4-(3H-1,3-benzoxazol-2-ylidene)-3-oxo-1-cyclohexa-1,5-dienyl]-2-(4-ethylphenoxy)acetamide SMR000105387 | cid_5922605
Type:
Small organic molecule
Emp. Form.:
C23H20N2O4
Mol. Mass.:
388.4159
SMILES:
CCc1ccc(OCC(=O)Nc2ccc(-c3nc4ccccc4o3)c(O)c2)cc1
: