Target
Heat shock cognate 71 kDa protein
Ligand
BDBM31691
Substrate
Meas. Tech.
High Throughput Screening Assay for Hsc70 Inhibitors
IC50
999000±n/a nM
Citation
 PubChem, PC High Throughput Screening Assay for Hsc70 Inhibitors PubChem Bioassay (2007)[AID] 
Target
Name:
Heat shock cognate 71 kDa protein
Synonyms:
HSC70 HSP7C_HUMAN HSPA8 heat shock 70kDa protein 8 isoform 2
Type:
Enzyme Catalytic Domain
Mol. Mass.:
70887.67
Organism:
Homo sapiens (Human)
Description:
gi_5729877
Residue:
646
  
Inhibitor
Name:
BDBM31691
Synonyms:
3-Methoxy-N-(9-phenylcarbamoylmethyl-9-aza-bicyclo[3.3.1]non-3-yl)-benzamide MLS000030189 N-[9-(2-anilino-2-oxoethyl)-9-azabicyclo[3.3.1]nonan-3-yl]-3-methoxybenzamide;hydrochloride cid_6602529
Type:
Small organic molecule
Emp. Form.:
C24H29N3O3
Mol. Mass.:
407.5054
SMILES:
[H]C12CCCC([H])(CC(C1)NC(=O)c1cccc(OC)c1)N2CC(=O)Nc1ccccc1
: