Target
Heat shock cognate 71 kDa protein
Ligand
BDBM31703
Substrate
Meas. Tech.
High Throughput Screening Assay for Hsc70 Inhibitors
IC50
999000±n/a nM
Citation
 PubChem, PC High Throughput Screening Assay for Hsc70 Inhibitors PubChem Bioassay (2007)[AID] 
Target
Name:
Heat shock cognate 71 kDa protein
Synonyms:
HSC70 HSP7C_HUMAN HSPA8 heat shock 70kDa protein 8 isoform 2
Type:
Enzyme Catalytic Domain
Mol. Mass.:
70887.67
Organism:
Homo sapiens (Human)
Description:
gi_5729877
Residue:
646
  
Inhibitor
Name:
BDBM31703
Synonyms:
3-(2,5-dimethyl-1-pyrrolyl)benzoic acid 3-(2,5-dimethylpyrrol-1-yl)benzoic acid SMR000068999 | cid_213329
Type:
Small organic molecule
Emp. Form.:
C13H13NO2
Mol. Mass.:
215.2478
SMILES:
Cc1ccc(C)n1-c1cccc(c1)C(O)=O
: