Target
Gag-Pol polyprotein
Ligand
BDBM267256
Substrate
Meas. Tech.
HIV-1 Reverse Transcriptase Inhibitory Assay
pH
7.8±n/a
Temperature
298.15±n/a K
IC50
7.00±n/a nM
Comments
extracted
Citation
 Arrington, KLBurgey, CGilfillan, RHan, YPatel, MLi, CSLuo, YLei, Z Non-nucleoside reverse transcriptase inhibitors US Patent  US9718819 Publication Date 8/1/2017 
Target
Name:
Gag-Pol polyprotein
Synonyms:
HIV-1 reverse transcriptase (HIV-1 RT) POL_HV1H2 Protease Reverse transcriptase (RT) gag-pol p66 RT
Type:
Protein
Mol. Mass.:
162074.74
Organism:
Human immunodeficiency virus type 1 group M subtype B (isolate HXB2)
Description:
P04585
Residue:
1435
  
Inhibitor
Name:
BDBM267256
Synonyms:
3-chloro-5-((1-((5- (3,5-difluorophenyl)- 6-oxo-1,6- dihydropyridazin-3- yl)methyl)-6-oxo-4- (trifluoromethyl)-1,6- dihydropyrimidin-5- yl)oxy)benzonitrile US9718819, 33
Type:
Small organic molecule
Emp. Form.:
C23H11ClF5N5O3
Mol. Mass.:
535.81
SMILES:
Fc1cc(F)cc(c1)-c1cc(Cn2cnc(c(Oc3cc(Cl)cc(c3)C#N)c2=O)C(F)(F)F)n[nH]c1=O
: