Target
Gag-Pol polyprotein
Ligand
BDBM267298
Substrate
Meas. Tech.
HIV-1 Reverse Transcriptase Inhibitory Assay
pH
7.8±n/a
Temperature
298.15±n/a K
IC50
20.0±n/a nM
Comments
extracted
Citation
 Arrington, KLBurgey, CGilfillan, RHan, YPatel, MLi, CSLuo, YLei, Z Non-nucleoside reverse transcriptase inhibitors US Patent  US9718819 Publication Date 8/1/2017 
Target
Name:
Gag-Pol polyprotein
Synonyms:
HIV-1 reverse transcriptase (HIV-1 RT) POL_HV1H2 Protease Reverse transcriptase (RT) gag-pol p66 RT
Type:
Protein
Mol. Mass.:
162074.74
Organism:
Human immunodeficiency virus type 1 group M subtype B (isolate HXB2)
Description:
P04585
Residue:
1435
  
Inhibitor
Name:
BDBM267298
Synonyms:
3-chloro-5-((1-((5-(4- cyanophenyl)-6-oxo- 1,6-dihydropyridazin- 3-yl)methyl)-6-oxo- 4-(trifluoromethyl)- 1,6- dihydropyrimidin-5- yl)oxy)benzonitrile US9718819, 75
Type:
Small organic molecule
Emp. Form.:
C24H12ClF3N6O3
Mol. Mass.:
524.839
SMILES:
FC(F)(F)c1ncn(Cc2cc(-c3ccc(cc3)C#N)c(=O)[nH]n2)c(=O)c1Oc1cc(Cl)cc(c1)C#N
: