Target
Gag-Pol polyprotein
Ligand
BDBM267385
Substrate
Meas. Tech.
HIV-1 Reverse Transcriptase Inhibitory Assay
pH
7.8±n/a
Temperature
298.15±n/a K
IC50
24.0±n/a nM
Comments
extracted
Citation
 Arrington, KLBurgey, CGilfillan, RHan, YPatel, MLi, CSLuo, YLei, Z Non-nucleoside reverse transcriptase inhibitors US Patent  US9718819 Publication Date 8/1/2017 
Target
Name:
Gag-Pol polyprotein
Synonyms:
HIV-1 reverse transcriptase (HIV-1 RT) POL_HV1H2 Protease Reverse transcriptase (RT) gag-pol p66 RT
Type:
Protein
Mol. Mass.:
162074.74
Organism:
Human immunodeficiency virus type 1 group M subtype B (isolate HXB2)
Description:
P04585
Residue:
1435
  
Inhibitor
Name:
BDBM267385
Synonyms:
2-fluoro-3-(6-oxo-1-((6-oxo-1,6-dihydropyridazin-3-yl)methyl)-4-(trifluoro methyl)-1,6-dihydropyrimidin-5-yloxy)benzonitrile US9718819, 161
Type:
Small organic molecule
Emp. Form.:
C17H9F4N5O3
Mol. Mass.:
407.2787
SMILES:
Fc1c(Oc2c(ncn(Cc3ccc(=O)[nH]n3)c2=O)C(F)(F)F)cccc1C#N
: