Target
Gag-Pol polyprotein
Ligand
BDBM267392
Substrate
Meas. Tech.
HIV-1 Reverse Transcriptase Inhibitory Assay
pH
7.8±n/a
Temperature
298.15±n/a K
IC50
5.00±n/a nM
Comments
extracted
Citation
 Arrington, KLBurgey, CGilfillan, RHan, YPatel, MLi, CSLuo, YLei, Z Non-nucleoside reverse transcriptase inhibitors US Patent  US9718819 Publication Date 8/1/2017 
Target
Name:
Gag-Pol polyprotein
Synonyms:
HIV-1 reverse transcriptase (HIV-1 RT) POL_HV1H2 Protease Reverse transcriptase (RT) gag-pol p66 RT
Type:
Protein
Mol. Mass.:
162074.74
Organism:
Human immunodeficiency virus type 1 group M subtype B (isolate HXB2)
Description:
P04585
Residue:
1435
  
Inhibitor
Name:
BDBM267392
Synonyms:
5-fluoro-3-((1-((5-(4- fluorophenyl)-6-oxo- 1,6-dihydropyridazin- 3-yl)methyl)-6-oxo- 4-(trifluoromethyl)- 1,6- dihydropyrimidin-5- yl)oxy)-2- methylbenzonitrile US9718819, 168
Type:
Small organic molecule
Emp. Form.:
C24H14F5N5O3
Mol. Mass.:
515.3917
SMILES:
Cc1c(Oc2c(ncn(Cc3cc(-c4ccc(F)cc4)c(=O)[nH]n3)c2=O)C(F)(F)F)cc(F)cc1[N+]#[C-]
: