Target
Integrin alpha-4
Ligand
BDBM50026604
Substrate
Meas. Tech.
Dose-Response of Allosteric Antagonists for the VLA-4 Integrin
EC50
17270±n/a nM
Citation
 PubChem, PC Dose-Response of Allosteric Antagonists for the VLA-4 Integrin PubChem Bioassay (2007)[AID] 
Target
Name:
Integrin alpha-4
Synonyms:
CD49 antigen-like family member D CD49d antigen ITA4_HUMAN Integrin alpha-4 Integrin alpha-IV VLA-4 integrin alpha 4 precursor | integrin alpha-4 precursor
Type:
Membrane Protein
Mol. Mass.:
114897.35
Organism:
Homo sapiens (Human)
Description:
P13612
Residue:
1032
  
Inhibitor
Name:
BDBM50026604
Synonyms:
1,2-Diphenyl-3,5-dioxo-4-(2-phenylsulfinylethyl)pyrazolidine 1,2-diphenyl-4-[2-(phenylsulfinyl)ethyl]pyrazolidine-3,5-dione Anturane (TN) SULFINPYRAZONE | Sulfoxyphenylpyrazolidine
Type:
Small organic molecule
Emp. Form.:
C23H20N2O3S
Mol. Mass.:
404.482
SMILES:
Oc1c(CCS(=O)c2ccccc2)c(=O)n(-c2ccccc2)n1-c1ccccc1
: